search:hunk failed相關網頁資料

瀏覽:748
日期:2024-04-24
17 May 2013 ... Skipping patch. n out of n hunks ignored. Hunk #n FAILED at nnn. n out of n hunks FAILED -- saving rejects to file file.rej; Hunk #n succeeded at ......
瀏覽:1033
日期:2024-04-23
1 Oct 2013 ... Hunk #1 FAILED at 34. Hunk #2 FAILED at 50. Hunk #14 FAILED at 628. Hunk # 15 FAILED at 635. 15 out of 15 hunks FAILED -- saving rejects ......
瀏覽:1276
日期:2024-04-26
12 Dec 2011 ... Hunk #8 FAILED at 1125. Hunk #9 succeeded at 1558 with fuzz 1 (offset 2 lines). 2 out of 9 hunks FAILED -- saving rejects to file dwm.c.rej....
瀏覽:467
日期:2024-04-26
9 Mar 2012 ... hg import bob.patch applying bob.patch patching file hello.c Hunk #1 FAILED at 1 1 out of 1 hunks FAILED -- saving rejects to file hello.c.rej ......
瀏覽:964
日期:2024-04-23
1 out of 1 hunk FAILED -- saving rejects to file qmail-clean.c.rej (Stripping trailing CRs from patch.) patching file hier.c. Hunk #1 FAILED at 100....
瀏覽:336
日期:2024-04-20
1 out of 1 hunk FAILED -- saving rejects to file page_title.install.rej patching file page_title.module. Hunk #1 FAILED at 220. Hunk #2 FAILED at ......
瀏覽:1056
日期:2024-04-26
26 Jul 2004 ... I type: patch -p1 poormanscron.module poormanscron.patch and I get Patching file poormanscron.module, Hunk #1 FAILED at 11. I have had ......
瀏覽:1145
日期:2024-04-21
24 Mar 2010 ... [ooo-build] How to resolve this problem "1 out of 1 hunk FAILED -- saving rejects to file ". Petr Mladek pmladek at suse.cz. Wed Mar 24 03:12:12 ......